{"text_format":"1","workbook":"xlsx","n_sheets":20,"sheets":["Instructions ","1 Year","2 Year","3 Year","4 Year","5 Year","RATES-Non Fed","Salary Inflation","A323 Form","NIH sal cap info","PM Conversion Chart","Ref","Sheet2","Sheet1","Multi Budget Sheet","Cost Share Budget","Sponsored Classes Index","For Equations","Catalyst Selection","Catalyst Selection2"],"not_rendered":{"charts":0,"images":1,"macros":1,"external_links":3,"defined_names":76,"comments":6,"pivot_tables":0},"unopened":[],"bounds":{"document_bytes":16777216,"sheet_cells":100000,"rows_first":2000,"rows_last":500,"rows_between":2000,"halvings":0,"cell_chars":16384,"cell_head_chars":4096},"cells_cut":0,"cells_raw":0,"read":"whole","date_system":"1900"}

{"sheet":"Instructions ","index":0,"n_rows":71,"n_cols":11,"rows_kept":71,"cut":false,"hidden":false,"merged":[[28,1,30,11],[37,1,38,11],[40,1,40,10],[35,10,35,12],[70,10,70,12]]}
["Instructions for Federal projects "]
[]
["Step 1:  MANDATORY"]
["Click on Rates worksheet"]
[null,"Change the budget period dates to coincide with your project period"]
[null,"Change the BUDGET INITIATION DATE to coincide with the date you started your budget (today's date). This is needed in order to calculate salary increases correctly"]
[]
[]
["Click on the worksheet that agrees with the number years you are requesting the sponsor to fund"]
[null,"Go to the \"Indirect Data\" section at the bottom of the worksheet and enter the indirect data relative to your project"]
{"$rows_left_out":62}
{"sheet":"1 Year","index":1,"n_rows":110,"n_cols":13,"rows_kept":110,"cut":false,"hidden":false,"merged":[[96,9,96,10],[7,9,7,11],[3,10,4,14],[93,12,93,14],[92,3,93,6],[7,1,7,6]]}
["Grants / Contracts",null,7]
["1 Year Budget "]
[" ",null,null,null,null,null,null,null,null," "]
["Sponsoring Agency : ",null,null,"name",null,null,null,null,"name","Titled : ","name"]
["Principal Investigator : ",null,null,"name"]
[null,"Period : ",null,{"$f":"'RATES-Non Fed'!E2","v":"2022-07-01"},"thru",null,{"$f":"'RATES-Non Fed'!G2","v":"2026-06-30"}]
[null,null,null,null,0.186,null,null,null,null," "]
[null," Salaries (Use these sections for UC personnel, UNLESS they are working directly for UCRI as Consultants. If working as consultants, use the blue section below for their costs",null,null,null,null,null,null,null,"Year 1",null,null,"CUMULATIVE"]
["A.","AAUP Faculty",null,null,null,null,null,null,null,"Sal","FB","Total"]
[null,null,null,"App't Type","% Effort","PM","Salary",null,null,null,null,null,{"$f":"IF(SUM(J10:L10)=0,\"\",SUM(J10:L10))","v":""}]
{"$rows_left_out":101}
{"sheet":"2 Year","index":2,"n_rows":110,"n_cols":16,"rows_kept":110,"cut":false,"hidden":false,"merged":[[92,3,93,6],[7,1,7,6],[96,9,96,10],[96,12,96,13],[3,10,4,14],[7,9,7,11],[7,12,7,14],[92,13,92,15]]}
["Grants / Contracts"]
["2 Year Budget "]
[" ",null,null,null,null,null,null,null,null," "]
["Sponsoring Agency : ",null,null,"name",null,null,null,null,null,"Titled : ","name"]
["Principal Investigator : ",null,null,"name"]
[null,"Period : ",null,{"$f":"'RATES-Non Fed'!E2","v":"2022-07-01"},"thru",null,{"$f":"'RATES-Non Fed'!G2","v":"2026-06-30"}]
[null,null,null,null,0.186,null,null,null,null," "]
[null," Salaries (Use these sections for UC personnel, UNLESS they are working directly for UCRI as Consultants. If working as consultants, use the blue section below for their costs",null,null,null,null,null,null,null,"Year 1",null,null,"Year 2",null,null,"CUMULATIVE"]
["A.",null,"AAUP Faculty",null,null,null,null,null,null,"Sal","FB","Total","Sal","FB","Total"]
[null,"Senior Personnel",null,"App't Type","% Effort","PM","Salary",null,null,null,null,null,null,null,null,{"$f":"IF(SUM(J10:N10)=0,\"\",SUM(J10:N10))","v":""}]
{"$rows_left_out":101}
{"sheet":"3 Year","index":3,"n_rows":110,"n_cols":19,"rows_kept":110,"cut":false,"hidden":false,"merged":[[96,9,96,10],[96,12,96,13],[96,15,96,16],[92,3,93,6],[3,10,4,17],[7,9,7,11],[7,12,7,14],[7,15,7,17],[93,16,93,18],[7,1,7,6]]}
["Grants / Contracts"]
["3 Year Budget "]
[" ",null,null,null,null,null,null,null,null," "]
["Sponsoring Agency : ",null,null,"name",null,null,null,null,null,"Titled : ","name"]
["Principal Investigator : ",null,null,"name"]
[null,"Period : ",null,{"$f":"'RATES-Non Fed'!E2","v":"2022-07-01"},"thru",null,{"$f":"'RATES-Non Fed'!G2","v":"2026-06-30"}]
[null,null,null,null,0.186,null,null,null,null," "]
[null," Salaries (Use these sections for UC personnel, UNLESS they are working directly for UCRI as Consultants. If working as consultants, use the blue section below for their costs",null,null,null,null,null,null,null,"Year 1",null,null,"Year 2",null,null,"Year 3",null,null,"CUMULATIVE"]
["A."," Salaries","AAUP Faculty",null,null,null,null,null,null,"Sal","FB","Total","Sal","FB","Total","Sal","FB","Total"]
[null,"Senior Personnel",null,"App't Type","% Effort","PM","Salary",null,null,null,null,null,null,null,null,null,null,null,{"$f":"IF(SUM(J10:N10)=0,\"\",SUM(J10:N10))","v":""}]
{"$rows_left_out":101}
{"sheet":"4 Year","index":4,"n_rows":110,"n_cols":22,"rows_kept":110,"cut":false,"hidden":false,"merged":[[93,20,93,22],[7,1,7,6],[3,10,4,20],[7,9,7,11],[7,12,7,14],[7,15,7,17],[7,18,7,20],[96,9,96,10],[96,12,96,13],[96,15,96,16],[96,18,96,19],[92,3,93,6]]}
["Grants / Contracts"]
["4 Year Budget "]
[" ",null,null,null,null,null,null,null,null," "]
["Sponsoring Agency : ",null,null,"name",null,null,null,null,null,"Titled : ","name"]
["Principal Investigator : ",null,null,"name"]
[null,"Period : ",null,{"$f":"'RATES-Non Fed'!E2","v":"2022-07-01"},"thru",null,{"$f":"'RATES-Non Fed'!G2","v":"2026-06-30"}]
[null,null,null,null,null,null,null,null,null," "]
[null," Salaries (Use these sections for UC personnel, UNLESS they are working directly for UCRI as Consultants. If working as consultants, use the blue section below for their costs",null,null,null,null,null,null,null,"Year 1",null,null,"Year 2",null,null,"Year 3",null,null,"Year 4",null,null,"CUMULATIVE"]
["A."," Salaries","AAUP Faculty",null,null,null,null,null,null,"Sal","FB","Total","Sal","FB","Total","Sal","FB","Total","Sal","FB","Total"]
[null,"Senior Personnel",null,"App't Type","% Effort","PM","Salary",null,null,null,null,null,null,null,null,null,null,null,null,null,null,{"$f":"IF(SUM(J10:N10)=0,\"\",SUM(J10:N10))","v":""}]
{"$rows_left_out":101}
{"sheet":"5 Year","index":5,"n_rows":110,"n_cols":25,"rows_kept":110,"cut":false,"hidden":false,"merged":[[7,21,7,23],[3,10,4,20],[92,3,93,6],[7,9,7,11],[7,12,7,14],[7,15,7,17],[7,18,7,20],[7,1,7,6],[96,9,96,10],[96,12,96,13],[96,15,96,16],[96,18,96,19],[96,21,96,22]]}
["Grants / Contracts"]
["5 Year Budget "]
[" ",null,null,null,null,null,null,null,null," "]
["Sponsoring Agency : ",null,null,"name",null,null,null,null,null,"Titled : ","name"]
["Principal Investigator : ",null,null,"name"]
[null,"Period : ",null,{"$f":"'RATES-Non Fed'!E2","v":"2022-07-01"},"thru",null,{"$f":"'RATES-Non Fed'!G2","v":"2026-06-30"}]
[null,null,null,null,null,null,null,null,null," "]
[null," Salaries (Use these sections for UC personnel, UNLESS they are working directly for UCRI as Consultants. If working as consultants, use the blue section below for their costs",null,null,null,null,null,null,null,"Year 1",null,null,"Year 2",null,null,"Year 3",null,null,"Year 4",null,null,"Year 5",null,null,"CUMULATIVE"]
["A."," Salaries","AAUP Faculty",null,null,null,null,null,null,"Sal","FB","Total","Sal","FB","Total","Sal","FB","Total","Sal","FB","Total","Sal","FB","Total"]
[null,"Senior Personnel",null,"App't Type","% Effort","PM","Salary",null,null,null,null,null,null,null,null,null,null,null,null,null,null,null,null,null,{"$f":"IF(SUM(J10:N10)=0,\"\",SUM(J10:N10))","v":""}]
{"$rows_left_out":101}
{"sheet":"RATES-Non Fed","index":6,"n_rows":65,"n_cols":49,"rows_kept":65,"cut":false,"hidden":false,"merged":[[13,23,13,35]]}
[]
[null,"Budget Period : ",null,null,"2022-07-01",null,"2026-06-30"]
[null,"Budget Initiation Date (TODAY'S DATE):",null,null,"2022-04-06"]
[]
[null,null,null,null,{"$f":"X16","v":"FY23"},null,{"$f":"Z16","v":"FY24"},null,{"$f":"AB16","v":"FY25"},null,{"$f":"AD16","v":"FY26"},null,{"$f":"AF16","v":"FY27"},null,{"$f":"AH16","v":"FY28"},null,{"$f":"AJ16","v":"FY29"}]
[null,"Fringe Benefit Rates",null,null,{"$f":"\"7/\"&RIGHT(TEXT(W15,\"0\"),2)&\"-6/\"&RIGHT(E5,2)","v":"7/22-6/23"},null,{"$f":"\"7/\"&RIGHT(E5,2)&\"-6/\"&RIGHT(G5,2)","v":"7/23-6/24"},null,{"$f":"\"7/\"&RIGHT(G5,2)&\"-6/\"&RIGHT(I5,2)","v":"7/24-6/25"},null,{"$f":"\"7/\"&RIGHT(I5,2)&\"-6/\"&RIGHT(K5,2)","v":"7/25-6/26"},null,{"$f":"\"7/\"&RIGHT(K5,2)&\"-6/\"&RIGHT(M5,2)","v":"7/26-6/27"},null,{"$f":"\"7/\"&RIGHT(M5,2)&\"-6/\"&RIGHT(O5,2)","v":"7/27-6/28"},null,{"$f":"\"7/\"&RIGHT(O5,2)&\"-6/\"&RIGHT(Q5,2)","v":"7/28-6/29"}]
[null,"Faculty (AAUP)",null,null,{"$f":"HLOOKUP(E$5,$AM$13:$AW$19,2,FALSE)","v":0.27800000000000002},null,{"$f":"HLOOKUP(G$5,$AM$13:$AW$19,2,FALSE)","v":0.307},null,{"$f":"HLOOKUP(I$5,$AM$13:$AW$19,2,FALSE)","v":0.30199999999999999},null,{"$f":"HLOOKUP(K$5,$AM$13:$AW$19,2,FALSE)","v":0.30499999999999999},null,{"$f":"HLOOKUP(M$5,$AM$13:$AW$19,2,FALSE)","v":0.308},null,{"$f":"HLOOKUP(O$5,$AM$13:$AW$19,2,FALSE)","v":0.311},null,{"$f":"HLOOKUP(Q$5,$AM$13:$AW$19,2,FALSE)","v":0.314}]
[null,"Exmpt Staff (Mnthly)/",null,null,{"$f":"HLOOKUP(E$5,$AM$13:$AW$19,3,FALSE)","v":0.375},null,{"$f":"HLOOKUP(G$5,$AM$13:$AW$19,3,FALSE)","v":0.40500000000000003},null,{"$f":"HLOOKUP(I$5,$AM$13:$AW$19,3,FALSE)","v":0.36099999999999999},null,{"$f":"HLOOKUP(K$5,$AM$13:$AW$19,3,FALSE)","v":0.36399999999999999},null,{"$f":"HLOOKUP(M$5,$AM$13:$AW$19,3,FALSE)","v":0.36699999999999999},null,{"$f":"HLOOKUP(O$5,$AM$13:$AW$19,3,FALSE)","v":0.37},null,{"$f":"HLOOKUP(Q$5,$AM$13:$AW$19,3,FALSE)","v":0.373}]
[null,"Dual Comp Faculty",null,null,{"$f":"HLOOKUP(E$5,$AM$13:$AW$19,4,FALSE)","v":0.44400000000000001},null,{"$f":"HLOOKUP(G$5,$AM$13:$AW$19,4,FALSE)","v":0.45700000000000002},null,{"$f":"HLOOKUP(I$5,$AM$13:$AW$19,4,FALSE)","v":0.41399999999999998},null,{"$f":"HLOOKUP(K$5,$AM$13:$AW$19,4,FALSE)","v":0.41699999999999998},null,{"$f":"HLOOKUP(M$5,$AM$13:$AW$19,4,FALSE)","v":0.42},null,{"$f":"HLOOKUP(O$5,$AM$13:$AW$19,4,FALSE)","v":0.42299999999999999},null,{"$f":"HLOOKUP(Q$5,$AM$13:$AW$19,4,FALSE)","v":0.42599999999999999}]
[null,"NonExempt Staff (Bi-Weekly)",null,null,{"$f":"HLOOKUP(E$5,$AM$13:$AW$19,5,FALSE)","v":0.39900000000000002},null,{"$f":"HLOOKUP(G$5,$AM$13:$AW$19,5,FALSE)","v":0.437},null,{"$f":"HLOOKUP(I$5,$AM$13:$AW$19,5,FALSE)","v":0.42299999999999999},null,{"$f":"HLOOKUP(K$5,$AM$13:$AW$19,5,FALSE)","v":0.42599999999999999},null,{"$f":"HLOOKUP(M$5,$AM$13:$AW$19,5,FALSE)","v":0.42899999999999999},null,{"$f":"HLOOKUP(O$5,$AM$13:$AW$19,5,FALSE)","v":0.432},null,{"$f":"HLOOKUP(Q$5,$AM$13:$AW$19,5,FALSE)","v":0.435}]
{"$rows_left_out":56}
{"sheet":"Salary Inflation","index":7,"n_rows":49,"n_cols":15,"rows_kept":49,"cut":false,"hidden":false,"merged":[]}
["Inflation Factors"]
["Employee Type","Start Date","FY","Increase",null,"Year 1 Fiscal Year days",null,null,null,null,"ACAD/SUMR Days Per Month"]
["AAUP Faculty","2020-09-01",{"$f":"IF(MONTH(B3)<7,YEAR(B3),YEAR(B3)+1)","v":2021},{"$f":"IF('RATES-Non Fed'!$E$3>=B3,0,0.03)","v":0}]
["AAUP Faculty","2021-09-01",2022,{"$f":"IF('RATES-Non Fed'!$E$3>=B4,0,0.03)","v":0},null,"Type","FY","Days",null,null,"Month","ACAD","SUMR","Total"]
["AAUP Faculty","2022-09-01",2023,0.04,null,"CAL",{"$f":"RIGHT('RATES-Non Fed'!E5,2)*1+2000","v":2023},{"$f":"'RATES-Non Fed'!C38","v":365},null,null,1,31,0,{"$f":"L5+M5","v":31}]
["AAUP Faculty","2023-09-01",2024,{"$f":"IF('RATES-Non Fed'!$E$3>=B6,0,0.03)","v":0.03},null,"CAL",{"$f":"RIGHT('RATES-Non Fed'!G5,2)*1+2000","v":2024},{"$f":"'RATES-Non Fed'!D38","v":0},null,null,2,28,0,28]
["AAUP Faculty","2024-09-01",2025,2.75E-2,null,"ACAD",{"$f":"RIGHT('RATES-Non Fed'!E5,2)*1+2000","v":2023},{"$f":"'RATES-Non Fed'!C44","v":255},null,null,3,31,0,31]
["AAUP Faculty","2025-09-01",2026,{"$f":"IF('RATES-Non Fed'!$E$3>=B8,0,0.03)","v":0.03},null,"ACAD",{"$f":"RIGHT('RATES-Non Fed'!G5,2)*1+2000","v":2024},{"$f":"'RATES-Non Fed'!D44","v":0},null,null,4,30,0,30]
["AAUP Faculty","2026-09-01",2027,{"$f":"IF('RATES-Non Fed'!$E$3>=B9,0,0.03)","v":0.03},null,"SUMR",{"$f":"RIGHT('RATES-Non Fed'!E5,2)*1+2000","v":2023},{"$f":"'RATES-Non Fed'!C45","v":110},null,null,5,13,18,31]
["AAUP Faculty","2027-09-01",2028,{"$f":"IF('RATES-Non Fed'!$E$3>=B10,0,0.03)","v":0.03},null,"SUMR",{"$f":"RIGHT('RATES-Non Fed'!G5,2)*1+2000","v":2024},{"$f":"'RATES-Non Fed'!D45","v":0},null,null,6,0,30,30]
{"$rows_left_out":40}
{"sheet":"A323 Form","index":8,"n_rows":82,"n_cols":11,"rows_kept":82,"cut":false,"hidden":false,"merged":[[10,6,10,7],[41,0,41,1],[42,0,42,1],[58,0,58,1],[59,0,59,1],[60,0,60,1],[43,0,43,1],[44,0,44,1],[45,0,45,1],[46,0,46,1],[68,0,68,1],[65,3,65,4],[65,0,65,1],[66,0,66,1],[61,0,61,1],[67,0,67,1],[9,1,9,4],[39,0,39,1],[40,0,40,1],[31,0,31,1],[32,0,32,1],[36,0,36,1],[37,0,37,1],[38,0,38,1],[33,0,33,1],[34,0,34,1],[35,0,35,1],[22,0,22,4],[23,0,23,2],[24,0,24,2],[23,4,27,4]]}
["UCRI Grant Set-up & Budget Form - Single Grant",null,null,null,"Revised 7/1/22"]
[]
["Date Sent to SRS:",null,"SRS completes green fields and blue fields automatically populate"]
["Date Returned:",null,"Departments complete fields indicated in yellow as needed."]
["Data Entry Date:"]
[]
["Grant Number:",null,null,"UCRI F&A Rate:",0.186]
["Grant Fund:","G700013 ",null,"UC F&A Rate:",0.124]
["Grant Name:","UCRI + Contract # ",null,null,null,null,null,null,"Research FA 1","Service FA 2"]
["Grant Description:","UCRI + Contract # + Description",null,null,null,null,null,null,0.62,0.31]
{"$rows_left_out":73}
{"sheet":"NIH sal cap info","index":9,"n_rows":39,"n_cols":9,"rows_kept":39,"cut":false,"hidden":false,"merged":[[38,3,38,4],[38,7,38,8],[8,2,8,3],[32,0,34,5],[32,6,34,7],[32,8,34,8],[36,0,36,2],[36,3,36,4]]}
[null,null,null,null,"Effective Dates",null,"NIH Annual Limitation","Limitation Based on 9 Month Appt.","Recess Cap"]
["DHHS Salary Caps"]
[null,null,null,null,"o  October 1, 1998 through December 31, 1999 ",null,125900,77476.92307692302,33896.153846153822]
["NIH1",null,62.6,null,"o  January 1, 2000 and beyond",null,130200,80123.076923076864,35053.846153846127]
[]
[null,null,null,null,"FY 2000 Awards  (Executive Level II)"]
["NIH2",null,65.72,null,"o  October 1, 1999 through December 31, 1999",null,136700,84123.076923076864,36803.846153846127]
["NIH3",null,67.930000000000007,null,"o  January 1, 2000 and beyond",null,141300,86953.846153846098,38042.307692307666]
["NIH4",null,69.760000000000005]
[null,null,null,null,"FY 2001 Awards  (Executive Level I)"]
{"$rows_left_out":30}
{"sheet":"PM Conversion Chart","index":10,"n_rows":17,"n_cols":8,"rows_kept":17,"cut":false,"hidden":false,"merged":[[6,9,6,10],[42,11,42,13],[5,0,5,1],[6,0,6,1],[5,12,5,13],[6,12,6,13],[5,3,5,4],[6,3,6,4],[5,6,5,7],[6,6,6,7],[5,9,5,10]]}
[null,null,null,null,null,null,null,"Percent of Time & Effort to Person Months (PM)"]
[null,null,null,null,null,null,null,"Interactive Conversion Table for the University of Cincinnati"]
[]
[]
[]
["EXC",null,null,"9 Month",null,null,"12 Month"]
["Recess",null,null,"Academic Year",null,null,"Calendar Year"]
[]
["  % effort ","         PM",null," % effort","PM",null,"  % effort","        PM"]
[]
{"$rows_left_out":8}
{"sheet":"Ref","index":11,"n_rows":11,"n_cols":6,"rows_kept":11,"cut":false,"hidden":false,"merged":[]}
[null,"Please DO NOT change any information on this sheet."]
[]
[]
[]
[]
[]
[]
[]
[null,null,"ACAD","Academic",null,"hourly"]
[null,null,"CAL","Calendar",null,"daily"]
{"$rows_left_out":2}
{"sheet":"Sheet2","index":12,"n_rows":0,"n_cols":0,"rows_kept":0,"cut":false,"hidden":false,"merged":[]}

{"sheet":"Sheet1","index":13,"n_rows":2,"n_cols":1,"rows_kept":2,"cut":false,"hidden":true,"merged":[]}
["Yes"]
["No"]

{"sheet":"Multi Budget Sheet","index":14,"n_rows":63,"n_cols":17,"rows_kept":63,"cut":false,"hidden":true,"merged":[[22,0,22,1],[23,3,23,4],[23,11,23,12],[9,1,9,5],[23,0,23,1],[21,3,21,4],[22,3,22,4],[19,3,19,4],[20,3,20,4],[24,0,24,1],[25,3,25,4],[25,11,25,12],[25,0,25,1],[26,3,26,4],[26,11,26,12],[24,3,24,4],[24,11,24,12],[26,0,26,1],[27,3,27,4],[27,11,27,12],[27,0,27,1],[28,3,28,4],[28,11,28,12],[28,0,28,1],[29,3,29,4],[29,11,29,12],[29,0,29,1],[30,3,30,4],[30,11,30,12],[39,0,39,1],[40,3,40,4],[40,11,40,12],[30,0,30,1],[31,3,31,4],[31,11,31,12],[31,0,31,1],[32,3,32,4],[32,11,32,12],[32,0,32,1],[33,3,33,4],[33,11,33,12],[34,3,34,4],[34,11,34,12],[35,3,35,4],[35,11,35,12],[36,3,36,4],[36,11,36,12],[49,11,49,12],[42,3,42,4],[42,11,42,12],[43,0,43,9],[40,0,40,1],[41,3,41,4],[41,11,41,12],[38,3,38,8],[37,0,37,1],[38,0,38,1],[39,3,39,4],[39,11,39,12],[44,0,44,1],[48,11,48,12],[60,3,60,4],[61,3,61,4],[58,3,58,4],[52,3,52,4],[53,3,53,4],[54,3,54,4],[59,3,59,4],[50,11,50,12],[45,3,45,8],[45,0,45,1],[46,3,46,4],[46,11,46,12],[46,0,46,1],[47,3,47,4],[47,11,47,12],[47,0,47,1],[48,3,48,4],[49,3,49,4],[50,3,50,4]]}
["A323 Streamlined Budget Form Multiple Grants",null,null,null,null,null,null,null,null,null,"*Insert",null,{"$f":"+'A323 Form'!E1","v":"Revised 7/1/22"}]
[]
["Date Sent:",null,"SRS completes green fields and blue fields automatically populate"]
["Date Returned:",null,"Departments complete fields indicated in yellow as needed."]
["Data Entry Date:"]
[]
["Primary Grant Number:",null,null,null,"UC F&A Rate:",null,null,"Departments:"]
["Grant Fund:"]
["Grant Name:",null,null,null,null,null,null,"Please remember to check for Salary caps!"]
["Grant Description:",null,null,null,null,null,null,"(DHHS, DOJ, etc.)"]
{"$rows_left_out":54}
{"sheet":"Cost Share Budget","index":15,"n_rows":44,"n_cols":12,"rows_kept":44,"cut":false,"hidden":true,"merged":[[34,5,34,7],[27,5,27,7],[29,2,29,3],[29,5,29,6],[31,5,31,6],[30,2,30,3],[30,5,30,6],[25,5,25,6],[27,2,27,3],[28,2,28,3],[28,5,28,6],[43,5,43,6],[36,2,36,3],[36,5,36,6],[37,2,37,3],[37,5,37,6],[38,5,38,6],[40,5,40,6],[41,5,41,6],[42,5,42,6],[35,2,35,3],[35,5,35,6],[33,0,33,6],[20,2,20,3],[20,5,20,6],[21,2,21,3],[21,5,21,6],[24,2,24,3],[24,5,24,6],[22,2,22,3],[22,5,22,6],[23,5,23,6],[23,2,23,3],[17,2,17,3],[17,5,17,6],[18,2,18,3],[18,5,18,6],[19,2,19,3],[19,5,19,6]]}
["A323 Stream Lined Cost Share Budget Form",null,null,null,null,null,null,{"$f":"+'A323 Form'!E1","v":"Revised 7/1/22"}]
[]
["Date Sent:",null,"SRS completes green fields and blue fields automatically populate"]
["Date Returned:",null,"Departments complete fields indicated in yellow as needed."]
["Data Entry Date:"]
[]
["Grant Number:",{"$f":"+'A323 Form'!B7","v":0},null,null,null,null,"Start Date:",{"$f":"+'A323 Form'!B12","v":"2022-07-01"}]
["Grant Name:",{"$f":"+'A323 Form'!B8","v":"G700013 "},null,null,null,null,"End Date:",{"$f":"+'A323 Form'!B13","v":"2026-06-30"}]
["Coeus Number:",{"$f":"+'A323 Form'!#REF!","v":{"$error":"#REF!"}},null,null,null,null,"Grant Fund:",{"$f":"+'A323 Form'!B16","v":"D"}]
["PI Last Name:",{"$f":"+'A323 Form'!B14","v":0},null,null,null,null,"F&A Rate:",0]
{"$rows_left_out":35}
{"sheet":"Sponsored Classes Index","index":16,"n_rows":67,"n_cols":2,"rows_kept":67,"cut":false,"hidden":true,"merged":[]}
["F&A RELEVANT CLASSES"]
[]
["[SALARY & FRINGE CLASSES]","Salary and fringe classes are set up for the full range of grants, with the exception of 1199, AFSCME and ONA salaries which"]
["AAUP Other Comp","require specific justification.  Administrative or clerical salaries are only allowed on major projects such as clinical research"]
["Acad Full Time Sal","centers or grants that require extensive data entry, making travel arrangements for a large number of participants, creating "]
["Acad Part Time Sal","manuals or working in a location inaccessible to normal departmental administrative services.  Refer to A-21 for more detailed"]
["Fringe Benefits","information about administrative and/or clerical costs."]
["Frng Bene Non Auto"]
["Graduate Assistants"]
["Intern Salaries"]
{"$rows_left_out":58}
{"sheet":"For Equations","index":17,"n_rows":4,"n_cols":1,"rows_kept":4,"cut":false,"hidden":true,"merged":[]}
["For Equations:"]
[{"$f":"MONTH('A323 Form'!B5)","v":1}]
[{"$f":"MONTH('Multi Budget Sheet'!B5)","v":1}]
[{"$f":"MONTH('Cost Share Budget'!B5)","v":1}]

{"sheet":"Catalyst Selection","index":18,"n_rows":3,"n_cols":1,"rows_kept":3,"cut":false,"hidden":true,"merged":[]}
["Select Catalyst Option from Drop Down"]
["Extension Only: SRS GA - e-mail D. Provine to request extension"]
["New Item Type(s) Needed - Please Send Item Type Catalyst Form"]

{"sheet":"Catalyst Selection2","index":19,"n_rows":2,"n_cols":1,"rows_kept":2,"cut":false,"hidden":true,"merged":[]}
["Extension Only: SRS GA - e-mail D. Provine to request extension"]
["New Item Type(s) Needed - Please Send Item Type Catalyst Form"]