{"text_format":"1","workbook":"xlsx","n_sheets":12,"sheets":["Instructions ","1 Year","2 Year","3 Year","4 Year","5 Year","RATES-Non Fed","Salary Inflation","NIH sal cap info","PM Conversion Chart","Ref","Kuali"],"not_rendered":{"charts":0,"images":1,"macros":1,"external_links":2,"defined_names":39,"comments":6,"pivot_tables":0},"unopened":[],"bounds":{"document_bytes":16777216,"sheet_cells":100000,"rows_first":2000,"rows_last":500,"rows_between":2000,"halvings":0,"cell_chars":16384,"cell_head_chars":4096},"cells_cut":0,"cells_raw":0,"read":"whole","date_system":"1900"}

{"sheet":"Instructions ","index":0,"n_rows":71,"n_cols":11,"rows_kept":71,"cut":false,"hidden":false,"merged":[[28,1,30,11],[37,1,38,11],[40,1,40,10],[35,10,35,12],[70,10,70,12]]}
["Instructions for Federal projects "]
[]
["Step 1:  MANDATORY"]
["Click on Rates worksheet"]
[null,"Change the budget period dates to coincide with your project period"]
[null,"Change the BUDGET INITIATION DATE to coincide with the date you started your budget (today's date). This is needed in order to calculate salary increases correctly"]
[]
[]
["Click on the worksheet that agrees with the number years you are requesting the sponsor to fund"]
[null,"Go to the \"Indirect Data\" section at the bottom of the worksheet and enter the indirect data relative to your project"]
{"$rows_left_out":62}
{"sheet":"1 Year","index":1,"n_rows":85,"n_cols":13,"rows_kept":85,"cut":false,"hidden":false,"merged":[[7,9,7,11],[3,10,4,14],[84,12,84,14],[83,3,84,6]]}
["Grants / Contracts"]
["1 Year Budget "]
[" ",null,null,null,null,null,null,null,null," "]
["Sponsoring Agency : ",null,null,"name",null,null,null,null,"name","Titled : ","name"]
["Principal Investigator : ",null,null,"name"]
[null,"Period : ",null,{"$f":"'RATES-Non Fed'!E2","v":"2024-01-01"},"thru",null,{"$f":"'RATES-Non Fed'!G2","v":"1930-12-31"}]
[null,null,null,null,null,null,null,null,null," "]
[null," Salaries",null,null,null,null,null,null,null,"Year 1",null,null,"CUMULATIVE"]
["A.","AAUP Faculty",null,null,null,null,null,null,null,"Sal","FB","Total"]
[null,null,null,"App't Type","% Effort","PM","Salary",null,null,null,null,null,{"$f":"IF(SUM(J10:L10)=0,\"\",SUM(J10:L10))","v":""}]
{"$rows_left_out":76}
{"sheet":"2 Year","index":2,"n_rows":86,"n_cols":16,"rows_kept":86,"cut":false,"hidden":false,"merged":[[3,10,4,14],[7,9,7,11],[7,12,7,14],[84,13,84,15],[84,3,85,6]]}
["Grants / Contracts"]
["2 Year Budget "]
[" ",null,null,null,null,null,null,null,null," "]
["Sponsoring Agency : ",null,null,"name",null,null,null,null,null,"Titled : ","name"]
["Principal Investigator : ",null,null,"name"]
[null,"Period : ",null,{"$f":"'RATES-Non Fed'!E2","v":"2024-01-01"},"thru",null,{"$f":"'RATES-Non Fed'!G2","v":"1930-12-31"}]
[null,null,null,null,null,null,null,null,null," "]
[null,null," Salaries",null,null,null,null,null,null,"Year 1",null,null,"Year 2",null,null,"CUMULATIVE"]
["A.",null,null,null,null,null,null,null,null,"Sal","FB","Total","Sal","FB","Total"]
[null,"Senior Personnel",null,"App't Type","% Effort","PM","Salary",null,null,null,null,null,null,null,null,{"$f":"IF(SUM(J10:N10)=0,\"\",SUM(J10:N10))","v":""}]
{"$rows_left_out":77}
{"sheet":"3 Year","index":3,"n_rows":85,"n_cols":19,"rows_kept":85,"cut":false,"hidden":false,"merged":[[83,3,84,6],[3,10,4,17],[7,9,7,11],[7,12,7,14],[7,15,7,17],[84,16,84,18]]}
["Grants / Contracts"]
["3 Year Budget "]
[" ",null,null,null,null,null,null,null,null," "]
["Sponsoring Agency : ",null,null,"name",null,null,null,null,null,"Titled : ","name"]
["Principal Investigator : ",null,null,"name"]
[null,"Period : ",null,{"$f":"'RATES-Non Fed'!E2","v":"2024-01-01"},"thru",null,{"$f":"'RATES-Non Fed'!G2","v":"1930-12-31"}]
[null,null,null,null,null,null,null,null,null," "]
[null,null,null,null,null,null,null,null,null,"Year 1",null,null,"Year 2",null,null,"Year 3",null,null,"CUMULATIVE"]
["A."," Salaries",null,null,null,null,null,null,null,"Sal","FB","Total","Sal","FB","Total","Sal","FB","Total"]
[null,"Senior Personnel",null,"App't Type","% Effort","PM","Salary",null,null,null,null,null,null,null,null,null,null,null,{"$f":"IF(SUM(J10:N10)=0,\"\",SUM(J10:N10))","v":""}]
{"$rows_left_out":76}
{"sheet":"4 Year","index":4,"n_rows":85,"n_cols":22,"rows_kept":85,"cut":false,"hidden":false,"merged":[[83,3,84,6],[3,10,4,20],[7,9,7,11],[7,12,7,14],[7,15,7,17],[7,18,7,20],[84,20,84,22]]}
["Grants / Contracts"]
["4 Year Budget "]
[" ",null,null,null,null,null,null,null,null," "]
["Sponsoring Agency : ",null,null,"name",null,null,null,null,null,"Titled : ","name"]
["Principal Investigator : ",null,null,"name"]
[null,"Period : ",null,{"$f":"'RATES-Non Fed'!E2","v":"2024-01-01"},"thru",null,{"$f":"'RATES-Non Fed'!G2","v":"1930-12-31"}]
[null,null,null,null,null,null,null,null,null," "]
[null,null,null,null,null,null,null,null,null,"Year 1",null,null,"Year 2",null,null,"Year 3",null,null,"Year 4",null,null,"CUMULATIVE"]
["A."," Salaries",null,null,null,null,null,null,null,"Sal","FB","Total","Sal","FB","Total","Sal","FB","Total","Sal","FB","Total"]
[null,"Senior Personnel",null,"App't Type","% Effort","PM","Salary",null,null,null,null,null,null,null,null,null,null,null,null,null,null,{"$f":"IF(SUM(J10:N10)=0,\"\",SUM(J10:N10))","v":""}]
{"$rows_left_out":76}
{"sheet":"5 Year","index":5,"n_rows":85,"n_cols":25,"rows_kept":85,"cut":false,"hidden":false,"merged":[[7,21,7,23],[3,10,4,20],[83,3,84,6],[7,9,7,11],[7,12,7,14],[7,15,7,17],[7,18,7,20]]}
["Grants / Contracts"]
["5 Year Budget "]
[" ",null,null,null,null,null,null,null,null," "]
["Sponsoring Agency : ",null,null,"name",null,null,null,null,null,"Titled : ","name"]
["Principal Investigator : ",null,null,"name"]
[null,"Period : ",null,{"$f":"'RATES-Non Fed'!E2","v":"2024-01-01"},"thru",null,{"$f":"'RATES-Non Fed'!G2","v":"1930-12-31"}]
[null,null,null,null,null,null,null,null,null," "]
[null,null,null,null,null,null,null,null,null,"Year 1",null,null,"Year 2",null,null,"Year 3",null,null,"Year 4",null,null,"Year 5",null,null,"CUMULATIVE"]
["A."," Salaries",null,null,null,null,null,null,null,"Sal","FB","Total","Sal","FB","Total","Sal","FB","Total","Sal","FB","Total","Sal","FB","Total"]
[null,"Senior Personnel",null,"App't Type","% Effort","PM","Salary",null,null,null,null,null,null,null,null,null,null,null,null,null,null,null,null,null,{"$f":"IF(SUM(J10:N10)=0,\"\",SUM(J10:N10))","v":""}]
{"$rows_left_out":76}
{"sheet":"RATES-Non Fed","index":6,"n_rows":65,"n_cols":49,"rows_kept":65,"cut":false,"hidden":false,"merged":[[13,23,13,35]]}
[]
[null,"Budget Period : ",null,null,"2024-01-01",null,"1930-12-31"]
[null,"Budget Initiation Date (TODAY'S DATE):",null,null,"2024-01-01"]
[]
[null,null,null,null,{"$f":"X16","v":"FY24"},null,{"$f":"Z16","v":"FY25"},null,{"$f":"AB16","v":"FY26"},null,{"$f":"AD16","v":"FY27"},null,{"$f":"AF16","v":"FY28"},null,{"$f":"AH16","v":"FY29"},null,{"$f":"AJ16","v":"FY30"}]
[null,"Fringe Benefit Rates",null,null,{"$f":"\"7/\"&RIGHT(TEXT(W15,\"0\"),2)&\"-6/\"&RIGHT(E5,2)","v":"7/23-6/24"},null,{"$f":"\"7/\"&RIGHT(E5,2)&\"-6/\"&RIGHT(G5,2)","v":"7/24-6/25"},null,{"$f":"\"7/\"&RIGHT(G5,2)&\"-6/\"&RIGHT(I5,2)","v":"7/25-6/26"},null,{"$f":"\"7/\"&RIGHT(I5,2)&\"-6/\"&RIGHT(K5,2)","v":"7/26-6/27"},null,{"$f":"\"7/\"&RIGHT(K5,2)&\"-6/\"&RIGHT(M5,2)","v":"7/27-6/28"},null,{"$f":"\"7/\"&RIGHT(M5,2)&\"-6/\"&RIGHT(O5,2)","v":"7/28-6/29"},null,{"$f":"\"7/\"&RIGHT(O5,2)&\"-6/\"&RIGHT(Q5,2)","v":"7/29-6/30"}]
[null,"Faculty (AAUP)",null,null,{"$f":"HLOOKUP(E$5,$AM$13:$AW$19,2,FALSE)","v":0.307},null,{"$f":"HLOOKUP(G$5,$AM$13:$AW$19,2,FALSE)","v":0.308},null,{"$f":"HLOOKUP(I$5,$AM$13:$AW$19,2,FALSE)","v":0.312},null,{"$f":"HLOOKUP(K$5,$AM$13:$AW$19,2,FALSE)","v":0.314},null,{"$f":"HLOOKUP(M$5,$AM$13:$AW$19,2,FALSE)","v":0.317},null,{"$f":"HLOOKUP(O$5,$AM$13:$AW$19,2,FALSE)","v":0.31900000000000001},null,{"$f":"HLOOKUP(Q$5,$AM$13:$AW$19,2,FALSE)","v":0.32200000000000001}]
[null,"Exmpt Staff (Mnthly)/",null,null,{"$f":"HLOOKUP(E$5,$AM$13:$AW$19,3,FALSE)","v":0.40500000000000003},null,{"$f":"HLOOKUP(G$5,$AM$13:$AW$19,3,FALSE)","v":0.35099999999999998},null,{"$f":"HLOOKUP(I$5,$AM$13:$AW$19,3,FALSE)","v":0.36399999999999999},null,{"$f":"HLOOKUP(K$5,$AM$13:$AW$19,3,FALSE)","v":0.36699999999999999},null,{"$f":"HLOOKUP(M$5,$AM$13:$AW$19,3,FALSE)","v":0.37},null,{"$f":"HLOOKUP(O$5,$AM$13:$AW$19,3,FALSE)","v":0.373},null,{"$f":"HLOOKUP(Q$5,$AM$13:$AW$19,3,FALSE)","v":0.376}]
[null,"Dual Comp Faculty",null,null,{"$f":"HLOOKUP(E$5,$AM$13:$AW$19,4,FALSE)","v":0.45700000000000002},null,{"$f":"HLOOKUP(G$5,$AM$13:$AW$19,4,FALSE)","v":0.42499999999999999},null,{"$f":"HLOOKUP(I$5,$AM$13:$AW$19,4,FALSE)","v":0.442},null,{"$f":"HLOOKUP(K$5,$AM$13:$AW$19,4,FALSE)","v":0.45400000000000001},null,{"$f":"HLOOKUP(M$5,$AM$13:$AW$19,4,FALSE)","v":0.46700000000000003},null,{"$f":"HLOOKUP(O$5,$AM$13:$AW$19,4,FALSE)","v":0.48099999999999998},null,{"$f":"HLOOKUP(Q$5,$AM$13:$AW$19,4,FALSE)","v":0.495}]
[null,"NonExempt Staff (Bi-Weekly)",null,null,{"$f":"HLOOKUP(E$5,$AM$13:$AW$19,5,FALSE)","v":0.437},null,{"$f":"HLOOKUP(G$5,$AM$13:$AW$19,5,FALSE)","v":0.54800000000000004},null,{"$f":"HLOOKUP(I$5,$AM$13:$AW$19,5,FALSE)","v":0.49},null,{"$f":"HLOOKUP(K$5,$AM$13:$AW$19,5,FALSE)","v":0.495},null,{"$f":"HLOOKUP(M$5,$AM$13:$AW$19,5,FALSE)","v":0.5},null,{"$f":"HLOOKUP(O$5,$AM$13:$AW$19,5,FALSE)","v":0.504},null,{"$f":"HLOOKUP(Q$5,$AM$13:$AW$19,5,FALSE)","v":0.50900000000000001}]
{"$rows_left_out":56}
{"sheet":"Salary Inflation","index":7,"n_rows":49,"n_cols":15,"rows_kept":49,"cut":false,"hidden":false,"merged":[]}
["Inflation Factors"]
["Employee Type","Start Date","FY","Increase",null,"Year 1 Fiscal Year days",null,null,null,null,"ACAD/SUMR Days Per Month"]
["AAUP Faculty","2023-09-01",{"$f":"IF(MONTH(B3)<7,YEAR(B3),YEAR(B3)+1)","v":2024},{"$f":"IF('RATES-Non Fed'!$E$3>=B3,0,0.03)","v":0}]
["AAUP Faculty","2024-09-01",{"$f":"IF(MONTH(B4)<7,YEAR(B4),YEAR(B4)+1)","v":2025},{"$f":"IF('RATES-Non Fed'!$E$3>=B4,0,0.03)","v":0.03},null,"Type","FY","Days",null,null,"Month","ACAD","SUMR","Total"]
["AAUP Faculty","2025-09-01",{"$f":"IF(MONTH(B5)<7,YEAR(B5),YEAR(B5)+1)","v":2026},{"$f":"IF('RATES-Non Fed'!$E$3>=B5,0,0.03)","v":0.03},null,"CAL",{"$f":"RIGHT('RATES-Non Fed'!E5,2)*1+2000","v":2024},{"$f":"'RATES-Non Fed'!C38","v":181},null,null,1,31,0,{"$f":"L5+M5","v":31}]
["AAUP Faculty","2026-09-01",{"$f":"IF(MONTH(B6)<7,YEAR(B6),YEAR(B6)+1)","v":2027},{"$f":"IF('RATES-Non Fed'!$E$3>=B6,0,0.03)","v":0.03},null,"CAL",{"$f":"RIGHT('RATES-Non Fed'!G5,2)*1+2000","v":2025},{"$f":"'RATES-Non Fed'!D38","v":184},null,null,2,28,0,28]
["AAUP Faculty","2027-09-01",2028,{"$f":"IF('RATES-Non Fed'!$E$3>=B7,0,0.03)","v":0.03},null,"ACAD",{"$f":"RIGHT('RATES-Non Fed'!E5,2)*1+2000","v":2024},{"$f":"'RATES-Non Fed'!C44","v":133},null,null,3,31,0,31]
["AAUP Faculty","2028-09-01",2029,{"$f":"IF('RATES-Non Fed'!$E$3>=B8,0,0.03)","v":0.03},null,"ACAD",{"$f":"RIGHT('RATES-Non Fed'!G5,2)*1+2000","v":2025},{"$f":"'RATES-Non Fed'!D44","v":122},null,null,4,30,0,30]
["AAUP Faculty","2029-09-01",2030,{"$f":"IF('RATES-Non Fed'!$E$3>=B9,0,0.03)","v":0.03},null,"SUMR",{"$f":"RIGHT('RATES-Non Fed'!E5,2)*1+2000","v":2024},{"$f":"'RATES-Non Fed'!C45","v":48},null,null,5,13,18,31]
["AAUP Faculty","2030-09-01",2031,{"$f":"IF('RATES-Non Fed'!$E$3>=B10,0,0.02)","v":0.02},null,"SUMR",{"$f":"RIGHT('RATES-Non Fed'!G5,2)*1+2000","v":2025},{"$f":"'RATES-Non Fed'!D45","v":62},null,null,6,0,30,30]
{"$rows_left_out":40}
{"sheet":"NIH sal cap info","index":8,"n_rows":39,"n_cols":9,"rows_kept":39,"cut":false,"hidden":false,"merged":[[38,3,38,4],[38,7,38,8],[8,2,8,3],[32,0,34,5],[32,6,34,7],[32,8,34,8],[36,0,36,2],[36,3,36,4]]}
[null,null,null,null,"Effective Dates",null,"NIH Annual Limitation","Limitation Based on 9 Month Appt.","Recess Cap"]
["DHHS Salary Caps"]
[null,null,null,null,"o  October 1, 1998 through December 31, 1999 ",null,125900,77476.92307692302,33896.153846153822]
["NIH1",null,62.6,null,"o  January 1, 2000 and beyond",null,130200,80123.076923076864,35053.846153846127]
[]
[null,null,null,null,"FY 2000 Awards  (Executive Level II)"]
["NIH2",null,65.72,null,"o  October 1, 1999 through December 31, 1999",null,136700,84123.076923076864,36803.846153846127]
["NIH3",null,67.930000000000007,null,"o  January 1, 2000 and beyond",null,141300,86953.846153846098,38042.307692307666]
["NIH4",null,69.760000000000005]
[null,null,null,null,"FY 2001 Awards  (Executive Level I)"]
{"$rows_left_out":30}
{"sheet":"PM Conversion Chart","index":9,"n_rows":17,"n_cols":8,"rows_kept":17,"cut":false,"hidden":false,"merged":[[42,11,42,13],[5,0,5,1],[6,0,6,1],[5,12,5,13],[6,12,6,13],[5,3,5,4],[6,3,6,4],[5,6,5,7],[6,6,6,7],[5,9,5,10],[6,9,6,10]]}
[null,null,null,null,null,null,null,"Percent of Time & Effort to Person Months (PM)"]
[null,null,null,null,null,null,null,"Interactive Conversion Table for the University of Cincinnati"]
[]
[]
[]
["EXC",null,null,"9 Month",null,null,"12 Month"]
["Recess",null,null,"Academic Year",null,null,"Calendar Year"]
[]
["  % effort ","         PM",null," % effort","PM",null,"  % effort","        PM"]
[]
{"$rows_left_out":8}
{"sheet":"Ref","index":10,"n_rows":10,"n_cols":4,"rows_kept":10,"cut":false,"hidden":false,"merged":[]}
[null,"Please DO NOT change any information on this sheet."]
[]
[]
[]
[]
[]
[]
[]
[null,null,"ACAD","Academic"]
[null,null,"CAL","Calendar"]
{"$rows_left_out":1}
{"sheet":"Kuali","index":11,"n_rows":0,"n_cols":0,"rows_kept":0,"cut":false,"hidden":false,"merged":[]}